(E)-2-Octenyl acetate

Normal alkane RI, non-polar column, temperature ramp

View large format table.

Column type Active phase I Reference Comment
CapillaryCP Sil 8 CB1223.Marques, Wendler, et al., 200730. m/0.25 mm/0.25 μm, Helium, 50. C @ 3. min, 5. K/min; Tend: 280. C

Normal alkane RI, polar column, temperature ramp

View large format table.

Column type Active phase I Reference Comment
CapillaryCP Wax 52 CB1474.Chen, Chyau, et al., 200760. m/0.25 mm/0.25 μm, Helium, 3. K/min; Tstart: 40. C; Tend: 220. C

References

Marques, Wendler, et al., 2007
Marques, F.A.; Wendler, E.P.; Maia, B.E.L.N.S.; Ventura, M.U.; Arruda-Gatti, I.C., Identification of defensive compounds in metathoracic glands of adults of the stink bug Dichelops melacanthus (Hemiptera: Pentatomidae), J. Braz. Chem. Soc., 2007, 18, 6, 1242-1246, https://doi.org/10.1590/S0103-50532007000600020 . [all data]

Chen, Chyau, et al., 2007
Chen, C.-C.; Chyau, C.-C.; Hseu, TY.-H., Production of a COX-2 inhibitor, 2,4,5-trimethoxybenzaldehyde, with submerged cultured Antrodia camphorata, Lett. Appl. Microbiol., 2007, 44, 4, 387-392, https://doi.org/10.1111/j.1472-765X.2006.02087.x . [all data]