Methyl 3,4-dimethyl-2-thienyl disulfide

Van Den Dool and Kratz RI, non-polar column, temperature ramp

Data compiled by: NIST Mass Spectrometry Data Center, William E. Wallace, director

Column type Capillary
Active phase HP-1
Column length (m) 50.
Carrier gas He
Substrate
Column diameter (mm) 0.32
Phase thickness (μm) 1.05
Tstart (C) 40.
Tend (C) 260.
Heat rate (K/min) 2.
Initial hold (min)
Final hold (min)
I 1460.
ReferenceKuo, Chien, et al., 1990
Comment MSDC-RI

References

Kuo, Chien, et al., 1990
Kuo, M.-C.; Chien, M.; Ho, C.-T., Novel Polysulfides Identified in the Volatile Components from Welsh Onions (Allium fistulosum L. var. maichuon) and Scallions (Allium fistulosum L. var. caespitosum), J. Agric. Food Chem., 1990, 38, 6, 1378-1381, https://doi.org/10.1021/jf00096a017 . [all data]