2-Nonene, 4,6-dimethyl

Normal alkane RI, non-polar column, temperature ramp

Data compiled by: NIST Mass Spectrometry Data Center, William E. Wallace, director

Column type Capillary
Active phase Petrocol DH
Column length (m) 150.
Carrier gas
Substrate
Column diameter (mm) 0.25
Phase thickness (μm) 1.0
Tstart (C) 40.
Tend (C) 300.
Heat rate (K/min) 1.
Initial hold (min)
Final hold (min)
I 994.
ReferenceSojak, Kubinec, et al., 2006
Comment MSDC-RI

References

Sojak, Kubinec, et al., 2006
Sojak, L.; Kubinec, R.; Jurdakova, H.; Hajekova, E.; Bajus, M., GC-MS of polyethylene and polypropylene thermal cracking produxts, Petroleum Coal, 2006, 48, 1, 1-14. [all data]