1-Tridecene, 2,4,6,8,10,12-hexamethyl

Normal alkane RI, non-polar column, temperature ramp

View large format table.

Column type Active phase I Reference Comment
CapillaryPetrocol DH1580.Sojak, Kubinec, et al., 2006150. m/0.25 mm/1.0 μm, 1. K/min; Tstart: 40. C; Tend: 300. C

References

Sojak, Kubinec, et al., 2006
Sojak, L.; Kubinec, R.; Jurdakova, H.; Hajekova, E.; Bajus, M., GC-MS of polyethylene and polypropylene thermal cracking produxts, Petroleum Coal, 2006, 48, 1, 1-14. [all data]