Docosahexaenoic acid, methyl ester

Normal alkane RI, polar column, custom temperature program

Data compiled by: NIST Mass Spectrometry Data Center, William E. Wallace, director

Column type Capillary
Active phase CP-Wax 52CB
Column length (m) 25.
Carrier gas He
Substrate
Column diameter (mm) 0.25
Phase thickness (μm) 0.20
Program 90 0C (2 min) 15 0C/min -> 160 0C 2.5 0C/min -> 225 0C (3 min) 10 0C/min -> 240 0C (50 min)
I 2413.
ReferenceMjos, Meier, et al., 2006
Comment MSDC-RI

References

Mjos, Meier, et al., 2006
Mjos, S.A.; Meier, S.; Grahl-Nielsen, O., Geometrical isomerisation of double bonds in acid-catalysed preparation of fatty acid methyl esters, Eur. J. Lipid Sci. Technol., 2006, 108, 4, 315-322, https://doi.org/10.1002/ejlt.200500298 . [all data]