Avenaciolide, 6-(2-phenylethyl)-4-demethylene

Normal alkane RI, non-polar column, custom temperature program

Data compiled by: NIST Mass Spectrometry Data Center, William E. Wallace, director

Column type Capillary
Active phase DB-1
Column length (m)
Carrier gas
Substrate
Column diameter (mm)
Phase thickness (μm)
Program not specified
I 2207.
ReferenceAlves, Rubinger, et al., 2006
Comment MSDC-RI

References

Alves, Rubinger, et al., 2006
Alves, L.C.; Rubinger, M.M.M.; Jham, G.N.; Castelo-Branco, P.A.; Pilo-Veloso, D., Caracterização por Cromatografia Gasosa e Espectrometria de Massas de Bis-γ-lactonas com atividade fungicida, 29a Reunião Anual da Sociedade Brasileira de Química, 2006, retrieved from https://sec.sbq.org.br/cd29ra/listaresumo.htm, https://sec.sbq.org.br/cd29ra/resumos/T1917-1.pdf. [all data]