p-Mentha-1,4-dien-8-ol

Normal alkane RI, polar column, temperature ramp

View large format table.

Column type Active phase I Reference Comment
CapillaryCarbowax 20M1765.Krings, Brauer, et al., 200525. m/0.53 mm/2.0 μm, H2, 40. C @ 3. min, 5. K/min, 210. C @ 10. min

References

Krings, Brauer, et al., 2005
Krings, U.; Brauer, B.; Kaspera, R.; Berger, R.G., Biotransformation of gamma-terpinene using Stemphylium botryosum (Wallroth) yields p-mentha-1,4-dien-9-ol, a novel odorous monoterpenol, Biocatal. Biotransform., 2005, 23, 6, 457-463, https://doi.org/10.1080/10242420500444267 . [all data]