C29 17A,21B-Hopane

Normal alkane RI, non-polar column, temperature ramp

View large format table.

Column type Active phase I Reference Comment
CapillaryDB-13038.Hwang, 199015. m/0.25 mm/1.0 μm, He, 4. K/min; Tstart: 50. C; Tend: 300. C

References

Hwang, 1990
Hwang, R.J., Biomarker Analysis Using GC-MSD, J. Chromatogr. Sci., 1990, 28, 3, 109-113, https://doi.org/10.1093/chromsci/28.3.109 . [all data]