(-)-4-epi-Marsupellyl acetate

Normal alkane RI, non-polar column, temperature ramp

View large format table.

Column type Active phase I Reference Comment
CapillaryCP Sil 5 CB1731.Adio, 2005H2, 3. K/min; Column length: 25. m; Tstart: 50. C; Tend: 230. C

References

Adio, 2005
Adio, A.M., Isolation and structure elucidation of sesquiterpenoids from the essential oils of some liverworths (Hepaticae), Dissertation, Hamburg University, 2005, 265. [all data]