1,6-Hexanediol, tri-ethoxylated, diacrylate

Normal alkane RI, non-polar column, temperature ramp

View large format table.

Column type Active phase I Reference Comment
CapillaryMDN-52395.Yoo, Pace, et al., 200430. m/0.32 mm/0.25 μm, Helium, 50. C @ 3. min, 10. K/min, 320. C @ 10. min

References

Yoo, Pace, et al., 2004
Yoo, S.J.; Pace, G.V.; Khoo, B.K.; Lech, J.; Hartman, T.G., Mass spectrometry and gas chromatographic retention indices of selected UV/EB-Curable monomers and photoinitiators commonly used in food packaging print and coating formulations, RAD Tech. Report, 2004, 3, 60-68. [all data]