3,5,9-Undecatrien-2-one, 6,10-dimethyl, #3 (E,E-isomer)

Kovats' RI, non-polar column, isothermal

View large format table.

Column type Active phase Temperature (C) I Reference Comment
CapillaryOV-101170.1563.Gribanova, Kharitonov, et al., 1990N2; Column length: 50. m; Column diameter: 0.27 mm

References

Gribanova, Kharitonov, et al., 1990
Gribanova, S.V.; Kharitonov, Yu.Ya.; Dzhabarov, D.N.; Rudenko, B.A.; Yanotovskii, M.T., Investigation of the gas-chromatographic behaviour of intermediate products of vitamin E synthesis and their structural analogs on various stationary phases for the identification of impurities by their retention indices, Zh. Anal. Khim., 1990, 45, 8, 1561-1567. [all data]