Methyldithophosphonic acid, S-isobutyl S-(2-diethylaminoethyl) ester

Normal alkane RI, non-polar column, custom temperature program

View large format table.

Column type Active phase I Reference Comment
CapillaryMethyl Silicone1768.Savelieva and Zenkevich I., 2003Program: not specified
CapillaryMethyl Silicone1782.Savelieva and Zenkevich I., 2003Program: not specified

References

Savelieva and Zenkevich I., 2003
Savelieva, E.; Zenkevich I., Analisi GC/MS di agenti chimici nervini, Laboratorio 2000, 2003, 17, 6/7, 24-26. [all data]