3,4-Dimethyl-2,3-dibromopentane

Normal alkane RI, non-polar column, temperature ramp

View large format table.

Column type Active phase I Reference Comment
CapillaryHP-PONA1126.Liu and Yang, 200350. m/0.20 mm/0.50 μm, 35. C @ 8. min, 3.5 K/min, 230. C @ 10. min

References

Liu and Yang, 2003
Liu, Y.; Yang, H., Detailed alkene determination by bromination and gas chromatography with atomic emission detection. I. identification of the bromoalkenes/bromoalkanes in brominated gasoline, Se Pu - Chinese Journal of Chromatography, 2003, 21, 1, 1-8. [all data]