2-Methyl-2,3-dibromobutane

Normal alkane RI, non-polar column, temperature ramp

Data compiled by: NIST Mass Spectrometry Data Center, William E. Wallace, director

Column type Capillary
Active phase HP-PONA
Column length (m) 50.
Carrier gas
Substrate
Column diameter (mm) 0.20
Phase thickness (μm) 0.50
Tstart (C) 35.
Tend (C) 230.
Heat rate (K/min) 3.5
Initial hold (min) 8.
Final hold (min) 10.
I 972.
ReferenceLiu and Yang, 2003
Comment MSDC-RI

References

Liu and Yang, 2003
Liu, Y.; Yang, H., Detailed alkene determination by bromination and gas chromatography with atomic emission detection. I. identification of the bromoalkenes/bromoalkanes in brominated gasoline, Se Pu - Chinese Journal of Chromatography, 2003, 21, 1, 1-8. [all data]