Methyl olean-3-oxo-28-oate

Normal alkane RI, non-polar column, temperature ramp

View large format table.

Column type Active phase I Reference Comment
CapillaryDB-53560.da Camara, Shepherd, et al., 200230. m/0.25 mm/0.25 μm, He, 4. K/min; Tstart: 40. C; Tend: 290. C

References

da Camara, Shepherd, et al., 2002
da Camara, C.A.G.; Shepherd, S.L.K.; Joaquim, D.R.G., Análise químnica da cultura de tecidos do híbrido Clusia paralicola X Clusia weddelliana, Revista Brasileira de Farmacognosia, 2002, 12, 26-28, https://doi.org/10.1590/S0102-695X2002000300013 . [all data]