2,6,10,15,19-Pentamethylicosane, # 2
- Formula: C26H54
- Molecular weight: 366.7070
- IUPAC Standard InChIKey: GNBIPBDUVGSNTO-UHFFFAOYSA-N
- Chemical structure:

Normal alkane RI, non-polar column, custom temperature program

Column type | Active phase | I | Reference | Comment |
---|---|---|---|---|
Capillary | CP Sil 5 CB | 2274. | Pancost, Hopmans, et al., 2001 | 25. m/0.32 mm/0.12 μm, He; Program: 70 0C 20 0C/min -> 130 0C 4 0C?min -> 320 0C (14 min) |

References

Pancost, Hopmans, et al., 2001
Pancost, R.D.; Hopmans, E.C.; Sinninghe Damsté, J.S.; The Medinaut Shipboard Scientific Party,
Archaeal lipids in Mediterranean cold seeps: molecular proxies for anaerobic methane oxidation,
Geochim. Cosmochim. Acta, 2001, 65, 10, 1611-1627, https://doi.org/10.1016/S0016-7037(00)00562-7
. [all data]