Perhydrophenanthrene, 1A-(3R/S-methylhexyl)-2A,4bB,8,8,10aB-pentamethyl

Van Den Dool and Kratz RI, non-polar column, temperature ramp

View large format table.

Column type Active phase I Reference Comment
CapillarySE-542630.Azevedo, Zinu, et al., 200125. m/0.30 mm/0.25 μm, 8. K/min; Tstart: 80. C; Tend: 300. C

References

Azevedo, Zinu, et al., 2001
Azevedo, D.A.; Zinu, C.J.A.; Aquino Neto, F.R.; Simoneit, B.R.T., Possible origin of acyclic (linear and isoprenoid) and tricyclic terpane methyl ketones in a Tasmanian tasmanite bitumen, Org. Geochem., 2001, 32, 3, 443-448, https://doi.org/10.1016/S0146-6380(00)00164-9 . [all data]