Triphenyleno[1,12-bcd]furan

Lee's RI, non-polar column, custom temperature program

View large format table.

Column type Active phase I Reference Comment
CapillaryHP Ultra 2413.02zu Reckendorf, 200025. m/0.20 mm/0.33 μm, Helium; Program: 60 0C (2 min) 4 0C/min -> 230 0C 3 0C/min -> 320 0C (6 min)

References

zu Reckendorf, 2000
zu Reckendorf, R.M., Phenyl-substituted polycyclic aromatic compounds as intermediate products during pyrolitic reactions involving coal tars, pitches and related materials, Chromatographia, 2000, 52, 1/2, 67-76, https://doi.org/10.1007/BF02490795 . [all data]