Benzene, 1,2-dimethyl-4,5-bis-(1-methylethyl)

Normal alkane RI, polar column, isothermal

View large format table.

Column type Active phase Temperature (C) I Reference Comment
CapillaryPEG-40M100.1578.Nesterov, Nesterova, et al., 2000Column length: 50. m
CapillaryPEG-40M100.1579.Nesterov, Nesterova, et al., 2000Column length: 50. m
CapillaryPEG-40M120.1586.Nesterov, Nesterova, et al., 2000Column length: 50. m
CapillaryPEG-40M140.1593.Nesterov, Nesterova, et al., 2000Column length: 50. m
CapillaryPEG-40M160.1600.Nesterov, Nesterova, et al., 2000Column length: 50. m
CapillaryPEG-40M80.1570.Nesterov, Nesterova, et al., 2000Column length: 50. m

References

Nesterov, Nesterova, et al., 2000
Nesterov, I.A.; Nesterova, T.N.; Pimerzin, A.A.; Tsvetkov, V.S., Thermodynamics of alkylbenzene sorption and evaporation. IV. Enthalpies of evaporation and thermodynamics chracteristics of sorption by stationary phases OV-101 and PEG-40M, Izvestia vysshikh uchebnykh zavedenii. Khimia i khimicheskaia tekhnologia (Chemistry and chemical technology), 2000, 43, 4, 39-45. [all data]