1-Adamantyl phenyl ketone

Normal alkane RI, non-polar column, custom temperature program

View large format table.

Column type Active phase I Reference Comment
CapillaryApiezon L2018.Kurbatova, Kolosova, et al., 2000Program: not specified

References

Kurbatova, Kolosova, et al., 2000
Kurbatova, S.; Kolosova, E.; Solovova, N.; Finkelshtein, E.; Zemtsova, M., Gas-chromatographic investigation of adamantane oxygen derivatives, Vestn. Samara State Univ., 2000, 4, 18, 167-172. [all data]