(E)-10-Dodecenoic acid, 9-hydroxy-12-oxo, methyl ester, MSTFA-adduct, OH-TMS, # 1

Normal alkane RI, non-polar column, custom temperature program

View large format table.

Column type Active phase I Reference Comment
CapillaryDB-52317.Gallasch and Spiteller, 200030. m/0.32 mm/0.10 μm, H2; Program: not specified

References

Gallasch and Spiteller, 2000
Gallasch, B.A.W.; Spiteller, G., Synthesis of 9,12-Dioxo-10( Z)-dodecenoic acid, a new fatty acid metabolite derived from 9-hydroperoxy-10,12-octadecadienoic acid in Lentil seed ( Lens culinarisMedik.), Lipids, 2000, 35, 9, 953-960, https://doi.org/10.1007/s11745-000-0605-z . [all data]