(E)-10-Dodecenoic acid, 9,12-dioxo, methyl ester, ω-PFB-oxime

Normal alkane RI, non-polar column, custom temperature program

Data compiled by: NIST Mass Spectrometry Data Center, William E. Wallace, director

Column type Capillary
Active phase DB-5
Column length (m) 30.
Carrier gas H2
Substrate
Column diameter (mm) 0.32
Phase thickness (μm) 0.10
Program not specified
I 2621.
ReferenceGallasch and Spiteller, 2000
Comment MSDC-RI

References

Gallasch and Spiteller, 2000
Gallasch, B.A.W.; Spiteller, G., Synthesis of 9,12-Dioxo-10( Z)-dodecenoic acid, a new fatty acid metabolite derived from 9-hydroperoxy-10,12-octadecadienoic acid in Lentil seed ( Lens culinarisMedik.), Lipids, 2000, 35, 9, 953-960, https://doi.org/10.1007/s11745-000-0605-z . [all data]