Decalin-6β-pentanoic acid, β,1,1,5β,7α-pentamethyl, methyl ester, # 1

Normal alkane RI, non-polar column, temperature ramp

Data compiled by: NIST Mass Spectrometry Data Center, William E. Wallace, director

Column type Capillary
Active phase DB-5
Column length (m) 30.
Carrier gas He
Substrate
Column diameter (mm) 0.25
Phase thickness (μm) 0.25
Tstart (C) 100.
Tend (C) 320.
Heat rate (K/min) 2.5
Initial hold (min) 0.89
Final hold (min) 30.
I 1878.
ReferenceNascimento, Reboucas, et al., 1999
Comment MSDC-RI

References

Nascimento, Reboucas, et al., 1999
Nascimento, L.R.; Reboucas, L.M.C.; Koike, L.; Reis, F.A.M.; Soldan, A.L.; Cerqueira, J.R.; Marsaioli, A.J., Acidic biomarkers from Albacora oils, Campos Basin, Brazil, Org. Geochem., 1999, 30, 9, 1175-1191, https://doi.org/10.1016/S0146-6380(99)00107-2 . [all data]