Cyclohentriacontasiloxane, dohexacontamethyl

Normal alkane RI, non-polar column, temperature ramp

Data compiled by: NIST Mass Spectrometry Data Center, William E. Wallace, director

Column type Capillary
Active phase Methyl Silicone
Column length (m) 25.
Carrier gas He
Substrate
Column diameter (mm) 0.25
Phase thickness (μm) 0.1
Tstart (C) 40.
Tend (C) 350.
Heat rate (K/min) 5.
Initial hold (min)
Final hold (min)
I 4887.
ReferenceFujimoto, Ohtani, et al., 1990
Comment MSDC-RI

References

Fujimoto, Ohtani, et al., 1990
Fujimoto, S.; Ohtani, H.; Yamagiwa, K.; Tsuge, S., Study on retention behavior of cyclic siloxanes by high resolution pyrolysis-gas chromatography with a fused silica capillary column, J. Hi. Res. Chromatogr., 1990, 13, 6, 397-404, https://doi.org/10.1002/jhrc.1240130603 . [all data]