Enalapril desethyl - H2O, Me (Enalaprilate - H2O, Me)

Normal alkane RI, non-polar column, temperature ramp

View large format table.

Column type Active phase I Reference Comment
CapillaryHP-12735.Maurer, Kraemer, et al., 199812. m/0.20 mm/0.33 μm, Helium, 100. C @ 3. min, 30. K/min, 310. C @ 8. min

References

Maurer, Kraemer, et al., 1998
Maurer, H.H.; Kraemer, T.; Arlt, J.W., Screening for the detection of angiotensin-converting enzyme inhybitors, their metabolites, and AT II receptor antagonists, Therapeutical Drug Monitoring, 1998, 20, 6, 706-713, https://doi.org/10.1097/00007691-199812000-00022 . [all data]