β-D-Glucopyranoside, 1-(2-butyl), permethylated, # 2

Normal alkane RI, non-polar column, temperature ramp

Data compiled by: NIST Mass Spectrometry Data Center, William E. Wallace, director

Column type Capillary
Active phase HP-1
Column length (m) 30.
Carrier gas Nitrogen
Substrate
Column diameter (mm) 0.25
Phase thickness (μm) 0.25
Tstart (C) 110.
Tend (C) 200.
Heat rate (K/min) 6.
Initial hold (min) 2.
Final hold (min) 25.
I 1592.
ReferenceLee, Jun, et al., 1998
Comment MSDC-RI

References

Lee, Jun, et al., 1998
Lee, C.K.; Jun, J.H.; Seo, Y.H., Transglycosylation of permethylated methyl D-Glycopyranosides in the presence of trimethyl trifluoromethanesulfonate, Bull. Korean Chem. Soc., 1998, 19, 11, 1233-1238. [all data]