β-D-Galactopyranoside, permethylated

Normal alkane RI, non-polar column, temperature ramp

View large format table.

Column type Active phase I Reference Comment
CapillaryHP-11458.Lee, Jun, et al., 199830. m/0.25 mm/0.25 μm, Nitrogen, 110. C @ 2. min, 6. K/min, 200. C @ 25. min

References

Lee, Jun, et al., 1998
Lee, C.K.; Jun, J.H.; Seo, Y.H., Transglycosylation of permethylated methyl D-Glycopyranosides in the presence of trimethyl trifluoromethanesulfonate, Bull. Korean Chem. Soc., 1998, 19, 11, 1233-1238. [all data]