3-Octanone, 1-methylthio

Normal alkane RI, non-polar column, custom temperature program

View large format table.

Column type Active phase I Reference Comment
CapillaryDB-11340.Buttery, Teranishi, et al., 1990Column length: 60. m; Column diameter: 0.32 mm; Program: not specified

References

Buttery, Teranishi, et al., 1990
Buttery, R.G.; Teranishi, R.; Flath, R.A.; Ling, L.C., Identification of additional tomato paste volatiles, J. Agric. Food Chem., 1990, 38, 3, 792-795, https://doi.org/10.1021/jf00093a042 . [all data]