Cadinol

Normal alkane RI, polar column, temperature ramp

Data compiled by: NIST Mass Spectrometry Data Center, William E. Wallace, director

Column type Capillary
Active phase DB-Wax
Column length (m) 60.
Carrier gas N2
Substrate
Column diameter (mm) 0.25
Phase thickness (μm) 0.25
Tstart (C) 70.
Tend (C) 230.
Heat rate (K/min) 2.
Initial hold (min) 2.
Final hold (min) 20.
I 2036.
ReferenceTu, Onishi, et al., 2003
Comment MSDC-RI

References

Tu, Onishi, et al., 2003
Tu, N.T.M.; Onishi, Y.; Choi, H.S.; Kondo, Y.; Ukeda, H.; Sawamura, M., Characteristic odour components of Citrus sp. (Kiyookadaidai) cold-pressed peel oil, Flavour Fragr. J., 2003, 18, 6, 515-520, https://doi.org/10.1002/ffj.1260 . [all data]