C30 8,14-Secohopane, # 2

Normal alkane RI, non-polar column, custom temperature program

View large format table.

Column type Active phase I Reference Comment
CapillaryDB-53028.Yoneyama, Yamazaki, et al., 1996Helium; Column length: 30. m; Column diameter: 0.25 mm; Program: not specified

References

Yoneyama, Yamazaki, et al., 1996
Yoneyama, Y.; Yamazaki, M.; Yada, F.; Kita, O.; Yoshimoto, S.; Kato, T., Analyses of the Solvent-Soluble Products of Yubari and Taiheiyo Coals Treated with Zink and Butyl Iodide under Mild Conditions - Analyses of Saturate Fractions -, J. Japan Institute of Energy, 1996, 75, 1, 35-41, https://doi.org/10.3775/jie.75.35 . [all data]