cis-2,6-Dimethyl-2,7-octadien-1,6-diol

Normal alkane RI, polar column, custom temperature program

View large format table.

Column type Active phase I Reference Comment
CapillaryCP-Wax 52 CB2298.Carro Marino, López Tamames, et al., 1995H2; Column length: 30. m; Column diameter: 0.32 mm; Program: 60 0C 2 0C/min -> 220 0C 3 0C/min -> 245 0C

References

Carro Marino, López Tamames, et al., 1995
Carro Marino, N.; López Tamames, E.; García Jares, C.M., Contribution to the study of the aromatic potential of three muscat Vitis vinifera varieties: identification of new compounds, Food Sci. Technol. Int., 1995, 1, 2-3, 105-116, https://doi.org/10.1177/108201329500100206 . [all data]