1-Methoxy-24-methylhexacosane

Normal alkane RI, non-polar column, custom temperature program

View large format table.

Column type Active phase I Reference Comment
CapillaryRTX-52905.Schulz and Toft, 199330. m/0.25 mm/0.25 μm, Hydrogen; Program: 60 0C 50 0C/min -> 150 0C 3 0C/min -> 300 0C

References

Schulz and Toft, 1993
Schulz, S.; Toft, S., Branched long chain alkyl methyl ethers: a new class of lipids from spider silk, Tetrahedron, 1993, 49, 31, 6805-6820, https://doi.org/10.1016/S0040-4020(01)80424-5 . [all data]