4-Butylisoquinoline

Normal alkane RI, non-polar column, custom temperature program

View large format table.

Column type Active phase I Reference Comment
PackedSE-301705.Xiaoyun, Xiammou, et al., 1991Column length: 2. m; Program: not specified

References

Xiaoyun, Xiammou, et al., 1991
Xiaoyun, J.; Xiammou, Z.; Yijian, G., Kovats retention indices of some alkylquinolines, alkylisoquinolines, phenylalkyl- and phenoxyalkylpyridines, Chin, J, Chromatogr., 1991, 9, 3, 187-191. [all data]