1,2,4,5-Tetrathiane, 3-methyl-6-pentyl, #2

Van Den Dool and Kratz RI, non-polar column, temperature ramp

Data compiled by: NIST Mass Spectrometry Data Center, William E. Wallace, director

Column type Capillary
Active phase DB-1
Column length (m) 60.
Carrier gas He
Substrate
Column diameter (mm) 0.25
Phase thickness (μm) 0.25
Tstart (C) 40.
Tend (C) 220.
Heat rate (K/min) 2.
Initial hold (min)
Final hold (min) 10.
I 1771.
ReferenceZhang and Ho, 1989
Comment MSDC-RI

References

Zhang and Ho, 1989
Zhang, Y.; Ho, C.-T., Volatile compounds formed from thermnal interaction of 2,4-decadienal with cysteine and glutathione, J. Agric. Food Chem., 1989, 37, 4, 1016-1020, https://doi.org/10.1021/jf00088a044 . [all data]