O-(2-Chloro-1,1-difluoroethyl)methanechlorothionophosphonate

Normal alkane RI, non-polar column, custom temperature program

View large format table.

Column type Active phase I Reference Comment
CapillaryPolydimethyl siloxane1072.Sommer, Hartwig, et al., 1991Program: not specified

References

Sommer, Hartwig, et al., 1991
Sommer, H.; Hartwig, J.; Homeyer, B.; Matthaer, H.-D., Pesticidal thionophosphonic acid(amide) esters, 1991, 21, retrieved from http://www.wikipatents.com/4985415.html. [all data]