O-Methyl-O-(1,1-difluoro-2-bromoethyl)-phosphorothiochloridate

Normal alkane RI, non-polar column, custom temperature program

View large format table.

Column type Active phase I Reference Comment
CapillaryPolydimethyl siloxane1180.Sommer, Arlt, et al., 1991Program: not specified

References

Sommer, Arlt, et al., 1991
Sommer, H.; Arlt, D.; Hartwig, J.; Homeyer, B.; Matthaei, H.-D., Pesticidal Thionophosphonic Acid Amine Esters, 1991, 18. [all data]