2-Decanone, 9-methyl

Kovats' RI, polar column, temperature ramp

Data compiled by: NIST Mass Spectrometry Data Center, William E. Wallace, director

Column type Capillary
Active phase Carbowax 20M
Column length (m) 50.
Carrier gas He
Substrate
Column diameter (mm) 0.28
Phase thickness (μm)
Tstart (C) 70.
Tend (C) 190.
Heat rate (K/min) 2.
Initial hold (min)
Final hold (min)
I 1542.
ReferenceTressl, Friese, et al., 1978
Comment MSDC-RI

References

Tressl, Friese, et al., 1978
Tressl, R.; Friese, L.; Fendesack, F.; Köppler, H., Studies of the volatile composition of hops during storage, J. Agric. Food Chem., 1978, 26, 6, 1426-1430, https://doi.org/10.1021/jf60220a036 . [all data]