Heneicosane, 9-methyl

Normal alkane RI, non-polar column, temperature ramp

View large format table.

Column type Active phase I Reference Comment
CapillaryOV-12141.2Krkosova, Kubinec, et al., 2007100. m/0.32 mm/0.25 μm, Helium, 5. K/min, 310. C @ 5. min; Tstart: 30. C
CapillaryHP-12137.Haverty, Page, et al., 1991Helium, 3. K/min, 320. C @ 20. min; Column length: 30. m; Column diameter: 0.20 mm; Tstart: 150. C

References

Krkosova, Kubinec, et al., 2007
Krkosova, Z.; Kubinec, R.; Addova, G.; Jurdakova, H.; Blasko, J.; Ostrovsky, I.; Sojak, L., Gas chromatographic - mass spectrometric characterization of monomethylalkanes from fuel diesel, Petroleum Coal, 2007, 49, 3, 51-62. [all data]

Haverty, Page, et al., 1991
Haverty, M.I.; Page, M.; Thorne, B.L.; Escoubas, P., Cuticular hydrocarbons: species and population-level discrimination in termites, USDA Forest Service Gen. Tech. Report PSW-128, The Forest Service, U.S.Department of Agriculture, 1991, 52. [all data]