Imidazole, 1-[1-(4-chloro-2-trifluoromethylphenylimino)-2-propoxyethyl

Normal alkane RI, non-polar column, temperature ramp

Data compiled by: NIST Mass Spectrometry Data Center, William E. Wallace, director

Column type Capillary
Active phase Polydimethyl siloxane
Column length (m) 25.
Carrier gas He
Substrate
Column diameter (mm) 0.32
Phase thickness (μm) 0.52
Tstart (C) 60.
Tend (C) 270.
Heat rate (K/min) 6.
Initial hold (min)
Final hold (min)
I 2117.
ReferenceHayakawa, Niinomi, et al., 1990
Comment MSDC-RI

References

Hayakawa, Niinomi, et al., 1990
Hayakawa, S.; Niinomi, J.; Kato, S.; Kanamaru, T., Retention time and mass number of agrochemicals by capillary column GC/MS, Mie-ken Kankyo-Kagaku Senta-kenkyu-ho-koku (Report of the Environmental Science Institute of Mie Prefecture), 1990, 10, 53-56. [all data]