16β-Hydroxy-dehydroepiandrosterone, MO-TMS

Normal alkane RI, non-polar column, temperature ramp

Data compiled by: NIST Mass Spectrometry Data Center, William E. Wallace, director

Column type Capillary
Active phase BP-1
Column length (m) 25.
Carrier gas Helium
Substrate
Column diameter (mm) 0.22
Phase thickness (μm)
Tstart (C) 180.
Tend (C) 300.
Heat rate (K/min) 3.
Initial hold (min)
Final hold (min)
I 2840.
ReferenceYong, Pitt, et al., 1988
Comment MSDC-RI

References

Yong, Pitt, et al., 1988
Yong, A.B.W.; Pitt, J.J.; Montalto, J.; Davies, H.E.; Warne, G.L.; Connelly, J.F., Diagnosis of 21-hydroxylase deficiency in newborn infants by GC-MS of urinary steroids, Aust. Paediatr., 1988, 24, 280-285. [all data]