15β,17α-Dihydroxypregnenolone, MO-TMS

Normal alkane RI, non-polar column, temperature ramp

View large format table.

Column type Active phase I Reference Comment
CapillaryBP-12938.Yong, Pitt, et al., 1988Helium, 3. K/min; Column length: 25. m; Column diameter: 0.22 mm; Tstart: 180. C; Tend: 300. C

References

Yong, Pitt, et al., 1988
Yong, A.B.W.; Pitt, J.J.; Montalto, J.; Davies, H.E.; Warne, G.L.; Connelly, J.F., Diagnosis of 21-hydroxylase deficiency in newborn infants by GC-MS of urinary steroids, Aust. Paediatr., 1988, 24, 280-285. [all data]