GA12, 12-α-OH, Me-TMS

Normal alkane RI, non-polar column, custom temperature program

View large format table.

Column type Active phase I Reference Comment
CapillaryOV-12537.Yamane, Fujioka, et al., 198825. m/0.20 mm/0.25 μm; Program: not specified
CapillaryOV-12539.Yamane, Fujioka, et al., 198825. m/0.20 mm/0.25 μm; Program: not specified

References

Yamane, Fujioka, et al., 1988
Yamane, H.; Fujioka, S.; Spray, C.R.; Phinney, B.O.; MacMillan, J.; Gaskin, P.; Takahashi, N., Endogenous Gibberellines from Sporophytes of Two Tree Ferns, Cibotium glaucum and Dicksonia antarctica, Plant Phisiol., 1988, 86, 3, 857-862, https://doi.org/10.1104/pp.86.3.857 . [all data]