Clemizole, hydroxy-oxo, acetylated

Normal alkane RI, non-polar column, temperature ramp

View large format table.

Column type Active phase I Reference Comment
CapillaryHP-13120.Maurer and Pfleger, 198812. m/0.20 mm/0.33 μm, He, 100. C @ 3. min, 30. K/min, 310. C @ 5. min

References

Maurer and Pfleger, 1988
Maurer, H.; Pfleger, K., Toxicological detection of ethylenediamine and piperazine antihistamines and their metabolites in urine by computerized gas chromatography-mass spectrometry, Fresenius Z. Anal. Chem., 1988, 331, 7, 744-756, https://doi.org/10.1007/BF01105612 . [all data]