2-Ethyl-5-methylthiolane

Normal alkane RI, non-polar column, temperature ramp

View large format table.

Column type Active phase I Reference Comment
CapillaryOV-101967.Limin, Jichun, et al., 198875. C @ 8. min, 2. K/min; Column length: 25. m; Column diameter: 0.25 mm; Tend: 130. C

References

Limin, Jichun, et al., 1988
Limin, Z.; Jichun, J.; Shiyi, L.; Keman, S., Identification of sulfur ethers in Jianghan naphtha fractions, Acta Petrolei Sinica, 1988, 4, 1, 100-107. [all data]