3,20-Dioxo-11β,18-epoxy-17α,18,21-trihydroxy-4-pregnene, MO-TMS, anti

Normal alkane RI, non-polar column, custom temperature program

View large format table.

Column type Active phase I Reference Comment
CapillaryOV-13230.Ulick, Chu, et al., 1983Column diameter: 0.25 mm; Phase thickness: 0.25 μm; Program: not specified

References

Ulick, Chu, et al., 1983
Ulick, S.; Chu, M.D.; Land, M., Biosynthesis of 18-oxocortisol by aldosterone-producting adrenal tissue, J. Biol. Chem., 1983, 258, 9, 5498-5502. [all data]