15-Methyltriacontane

Normal alkane RI, non-polar column, temperature ramp

Data compiled by: NIST Mass Spectrometry Data Center, William E. Wallace, director

Column type CapillaryCapillary
Active phase BP-1BP-1
Column length (m) 12.12.
Carrier gas HeliumHelium
Substrate
Column diameter (mm) 0.220.22
Phase thickness (μm) 0.250.25
Tstart (C) 100.100.
Tend (C) 300.300.
Heat rate (K/min) 2.2.
Initial hold (min)
Final hold (min)
I 3025.3032.
ReferenceLockey and Oraha, 1990Lockey and Oraha, 1990
Comment MSDC-RI MSDC-RI

References

Lockey and Oraha, 1990
Lockey, K.H.; Oraha, V.S., Cuticular lipids of adult Locusta Migratoria Migratoriodes (R and F), Schstocerca Gregaria (Forskal) (Acrididae) and other orthopteran species - II. Hydrocarbons, Comp. Biochem. Physiol., 1990, 95B, 4, 721-744. [all data]