Glucose, 2,6-diethyl, nitrile, acetylated

Normal alkane RI, non-polar column, temperature ramp

Data compiled by: NIST Mass Spectrometry Data Center, William E. Wallace, director

Column type PackedPackedPacked
Active phase OV-5OV-5OV-5
Column length (m) 4.4.4.
Carrier gas
Substrate
Column diameter (mm)
Phase thickness (μm)
Tstart (C) 100.100.100.
Tend (C)
Heat rate (K/min) 2.4.6.
Initial hold (min)
Final hold (min)
I 1973.1968.1965.
ReferenceKajiyama, Ishibashi, et al., 1981Kajiyama, Ishibashi, et al., 1981Kajiyama, Ishibashi, et al., 1981
Comment MSDC-RI MSDC-RI MSDC-RI

References

Kajiyama, Ishibashi, et al., 1981
Kajiyama, K.; Ishibashi, T.; Shigeno, K., Gas chromatographic retention behaviour of O-acetylated aldononitriles of various O-methyl- and O-ethylglucoses. Comparison aith the behaviour of O-acetyl alditols, Sen-I- Gakkaishi, 1981, 37, 8, t322-t329, https://doi.org/10.2115/fiber.37.8_T322 . [all data]