Glucose, 2,3-dimethyl, acetylated

Normal alkane RI, non-polar column, temperature ramp

View large format table.

Column type Active phase I Reference Comment
PackedOV-52111.Kajiyama, Ishibashi, et al., 19816. K/min; Column length: 4. m; Tstart: 100. C

References

Kajiyama, Ishibashi, et al., 1981
Kajiyama, K.; Ishibashi, T.; Shigeno, K., Gas chromatographic retention behaviour of O-acetylated aldononitriles of various O-methyl- and O-ethylglucoses. Comparison aith the behaviour of O-acetyl alditols, Sen-I- Gakkaishi, 1981, 37, 8, t322-t329, https://doi.org/10.2115/fiber.37.8_T322 . [all data]