2,4,6-Trimethyl-1-nonene, # 1

Normal alkane RI, non-polar column, custom temperature program

Data compiled by: NIST Mass Spectrometry Data Center, William E. Wallace, director

Column type Packed
Active phase Apieson L
Column length (m) 20.
Carrier gas
Substrate Chromosorb W
Column diameter (mm)
Phase thickness (μm)
Program not specified
I 1070.
ReferenceKojima, Fujii, et al., 1980
Comment MSDC-RI

References

Kojima, Fujii, et al., 1980
Kojima, T.; Fujii, T.; Hosaka, Y., Thermal decomposition products of sterepisomeric polypropylenes, Mass Spectrometry, 1980, 28, 4, 335-341. [all data]