2,4,6,8-Tetramethyl-1-undecene, # 2

Normal alkane RI, non-polar column, temperature ramp

View large format table.

Column type Active phase I Reference Comment
CapillaryPetrocol DH1321.Sojak, Kubinec, et al., 2006150. m/0.25 mm/1.0 μm, 1. K/min; Tstart: 40. C; Tend: 300. C

Normal alkane RI, non-polar column, custom temperature program

View large format table.

Column type Active phase I Reference Comment
PackedApieson L1285.Kojima, Fujii, et al., 1980Chromosorb W; Column length: 20. m; Program: not specified

References

Sojak, Kubinec, et al., 2006
Sojak, L.; Kubinec, R.; Jurdakova, H.; Hajekova, E.; Bajus, M., GC-MS of polyethylene and polypropylene thermal cracking produxts, Petroleum Coal, 2006, 48, 1, 1-14. [all data]

Kojima, Fujii, et al., 1980
Kojima, T.; Fujii, T.; Hosaka, Y., Thermal decomposition products of sterepisomeric polypropylenes, Mass Spectrometry, 1980, 28, 4, 335-341. [all data]